Target
Nuclear receptor coactivator 2
Ligand
BDBM42896
Substrate
Meas. Tech.
Dose response biochemical High Throughput Screening assay for agonists of the steroid receptor coactivator 2 (SRC-2) recruitment by the peroxisome proliferator-activated receptor gamma (PPARgamma)
EC50
>79370±n/a nM
Citation
 PubChem, PC Dose response biochemical High Throughput Screening assay for agonists of the steroid receptor coactivator 2 (SRC-2) recruitment by the peroxisome proliferator-activated receptor gamma (PPARgamma) PubChem Bioassay (2008)[AID] 
Target
Name:
Nuclear receptor coactivator 2
Synonyms:
BHLHE75 NCOA2 protein SRC2 | TIF2
Type:
Enzyme Catalytic Domain
Mol. Mass.:
159156.93
Organism:
Homo sapiens (Human)
Description:
Q15596
Residue:
1464
  
Inhibitor
Name:
BDBM42896
Synonyms:
1-Ethanesulfonyl-4-(4-phenyl-cyclohexyl)-piperazine 1-ethylsulfonyl-4-(4-phenylcyclohexyl)piperazine;oxalic acid SMR000011966 ethanedioic acid;1-ethylsulfonyl-4-(4-phenylcyclohexyl)piperazine
Type:
Small organic molecule
Emp. Form.:
C18H28N2O2S
Mol. Mass.:
336.492
SMILES:
CCS(=O)(=O)N1CCN(CC1)C1CCC(CC1)c1ccccc1
: