Target
Nuclear receptor coactivator 2
Ligand
BDBM42900
Substrate
Meas. Tech.
Dose response biochemical High Throughput Screening assay for agonists of the steroid receptor coactivator 2 (SRC-2) recruitment by the peroxisome proliferator-activated receptor gamma (PPARgamma)
EC50
>79370±n/a nM
Citation
 PubChem, PC Dose response biochemical High Throughput Screening assay for agonists of the steroid receptor coactivator 2 (SRC-2) recruitment by the peroxisome proliferator-activated receptor gamma (PPARgamma) PubChem Bioassay (2008)[AID] 
Target
Name:
Nuclear receptor coactivator 2
Synonyms:
BHLHE75 NCOA2 protein SRC2 | TIF2
Type:
Enzyme Catalytic Domain
Mol. Mass.:
159156.93
Organism:
Homo sapiens (Human)
Description:
Q15596
Residue:
1464
  
Inhibitor
Name:
BDBM42900
Synonyms:
4-[2-(furan-2-yl)-4-(phenylsulfonyl)-1,3-oxazol-5-yl]morpholine 4-[4-(benzenesulfonyl)-2-(furan-2-yl)-1,3-oxazol-5-yl]morpholine MLS000068819 cid_659168
Type:
Small organic molecule
Emp. Form.:
C17H16N2O5S
Mol. Mass.:
360.384
SMILES:
O=S(=O)(c1nc(oc1N1CCOCC1)-c1ccco1)c1ccccc1
: