Target
Nuclear receptor coactivator 2
Ligand
BDBM39443
Substrate
Meas. Tech.
Dose response biochemical High Throughput Screening assay for agonists of the steroid receptor coactivator 2 (SRC-2) recruitment by the peroxisome proliferator-activated receptor gamma (PPARgamma)
EC50
9650±n/a nM
Citation
 PubChem, PC Dose response biochemical High Throughput Screening assay for agonists of the steroid receptor coactivator 2 (SRC-2) recruitment by the peroxisome proliferator-activated receptor gamma (PPARgamma) PubChem Bioassay (2008)[AID] 
Target
Name:
Nuclear receptor coactivator 2
Synonyms:
BHLHE75 NCOA2 protein SRC2 | TIF2
Type:
Enzyme Catalytic Domain
Mol. Mass.:
159156.93
Organism:
Homo sapiens (Human)
Description:
Q15596
Residue:
1464
  
Inhibitor
Name:
BDBM39443
Synonyms:
3,4-dimethyl-N-(5-thiophen-2-yl-1,3,4-thiadiazol-2-yl)benzamide MLS000078788 cid_659514
Type:
Small organic molecule
Emp. Form.:
C15H13N3OS2
Mol. Mass.:
315.413
SMILES:
Cc1ccc(cc1C)C(=O)Nc1nnc(s1)-c1cccs1
: