Target
Nuclear receptor coactivator 2
Ligand
BDBM42901
Substrate
Meas. Tech.
Dose response biochemical High Throughput Screening assay for agonists of the steroid receptor coactivator 2 (SRC-2) recruitment by the peroxisome proliferator-activated receptor gamma (PPARgamma)
EC50
>79370±n/a nM
Citation
 PubChem, PC Dose response biochemical High Throughput Screening assay for agonists of the steroid receptor coactivator 2 (SRC-2) recruitment by the peroxisome proliferator-activated receptor gamma (PPARgamma) PubChem Bioassay (2008)[AID] 
Target
Name:
Nuclear receptor coactivator 2
Synonyms:
BHLHE75 NCOA2 protein SRC2 | TIF2
Type:
Enzyme Catalytic Domain
Mol. Mass.:
159156.93
Organism:
Homo sapiens (Human)
Description:
Q15596
Residue:
1464
  
Inhibitor
Name:
BDBM42901
Synonyms:
(5E)-1-hexyl-5-[[(3-keto-1,5-dimethyl-2-phenyl-3-pyrazolin-4-yl)amino]methylene]barbituric acid (5E)-5-[[(1,5-dimethyl-3-oxo-2-phenyl-4-pyrazolyl)amino]methylidene]-1-hexyl-1,3-diazinane-2,4,6-trione MLS000078222 cid_5389191
Type:
Small organic molecule
Emp. Form.:
C22H27N5O4
Mol. Mass.:
425.4809
SMILES:
CCCCCCN1C(=O)NC(=O)C(=CNc2c(C)n(C)n(-c3ccccc3)c2=O)C1=O
: