Target
Nuclear receptor coactivator 2
Ligand
BDBM42902
Substrate
Meas. Tech.
Dose response biochemical High Throughput Screening assay for agonists of the steroid receptor coactivator 2 (SRC-2) recruitment by the peroxisome proliferator-activated receptor gamma (PPARgamma)
EC50
>79370±n/a nM
Citation
 PubChem, PC Dose response biochemical High Throughput Screening assay for agonists of the steroid receptor coactivator 2 (SRC-2) recruitment by the peroxisome proliferator-activated receptor gamma (PPARgamma) PubChem Bioassay (2008)[AID] 
Target
Name:
Nuclear receptor coactivator 2
Synonyms:
BHLHE75 NCOA2 protein SRC2 | TIF2
Type:
Enzyme Catalytic Domain
Mol. Mass.:
159156.93
Organism:
Homo sapiens (Human)
Description:
Q15596
Residue:
1464
  
Inhibitor
Name:
BDBM42902
Synonyms:
(4Z)-4-[amino(nitroso)methylidene]-5-hydroxy-1,2,5-oxadiazol-3-amine MLS000079106 [(Z)-(4-amino-2-hydroxy-furazan-3-ylidene)-nitroso-methyl]amine | cid_5389264
Type:
Small organic molecule
Emp. Form.:
C3H5N5O3
Mol. Mass.:
159.1035
SMILES:
NC1=NON(O)C1C(=N)N=O
: