Target
Nuclear receptor coactivator 2
Ligand
BDBM42908
Substrate
Meas. Tech.
Dose response biochemical High Throughput Screening assay for agonists of the steroid receptor coactivator 2 (SRC-2) recruitment by the peroxisome proliferator-activated receptor gamma (PPARgamma)
EC50
39700±n/a nM
Citation
 PubChem, PC Dose response biochemical High Throughput Screening assay for agonists of the steroid receptor coactivator 2 (SRC-2) recruitment by the peroxisome proliferator-activated receptor gamma (PPARgamma) PubChem Bioassay (2008)[AID] 
Target
Name:
Nuclear receptor coactivator 2
Synonyms:
BHLHE75 NCOA2 protein SRC2 | TIF2
Type:
Enzyme Catalytic Domain
Mol. Mass.:
159156.93
Organism:
Homo sapiens (Human)
Description:
Q15596
Residue:
1464
  
Inhibitor
Name:
BDBM42908
Synonyms:
6-(5-bromanylfuran-2-yl)-3-(4-chlorophenyl)-[1,2,4]triazolo[3,4-b][1,3,4]thiadiazole 6-(5-bromo-2-furyl)-3-(4-chlorophenyl)-[1,2,4]triazolo[3,4-b][1,3,4]thiadiazole MLS000041398 cid_665202
Type:
Small organic molecule
Emp. Form.:
C13H6BrClN4OS
Mol. Mass.:
381.635
SMILES:
Clc1ccc(cc1)-c1nnc2sc(nn12)-c1ccc(Br)o1
: