Target
Nuclear receptor coactivator 2
Ligand
BDBM40284
Substrate
Meas. Tech.
Dose response biochemical High Throughput Screening assay for agonists of the steroid receptor coactivator 2 (SRC-2) recruitment by the peroxisome proliferator-activated receptor gamma (PPARgamma)
EC50
23330±n/a nM
Citation
 PubChem, PC Dose response biochemical High Throughput Screening assay for agonists of the steroid receptor coactivator 2 (SRC-2) recruitment by the peroxisome proliferator-activated receptor gamma (PPARgamma) PubChem Bioassay (2008)[AID] 
Target
Name:
Nuclear receptor coactivator 2
Synonyms:
BHLHE75 NCOA2 protein SRC2 | TIF2
Type:
Enzyme Catalytic Domain
Mol. Mass.:
159156.93
Organism:
Homo sapiens (Human)
Description:
Q15596
Residue:
1464
  
Inhibitor
Name:
BDBM40284
Synonyms:
MLS000082661 N-(2,3-dihydro-1,4-benzodioxin-6-yl)-2-[(2-ethyl-[1]benzofuro[3,2-d]pyrimidin-4-yl)sulfanyl]acetamide N-(2,3-dihydro-1,4-benzodioxin-6-yl)-2-[(2-ethylbenzofuro[3,2-d]pyrimidin-4-yl)thio]acetamide cid_665236
Type:
Small organic molecule
Emp. Form.:
C22H19N3O4S
Mol. Mass.:
421.469
SMILES:
CCc1nc(SCC(=O)Nc2ccc3OCCOc3c2)c2oc3ccccc3c2n1
: