Target
Nuclear receptor coactivator 2
Ligand
BDBM42909
Substrate
Meas. Tech.
Dose response biochemical High Throughput Screening assay for agonists of the steroid receptor coactivator 2 (SRC-2) recruitment by the peroxisome proliferator-activated receptor gamma (PPARgamma)
EC50
>79370±n/a nM
Citation
 PubChem, PC Dose response biochemical High Throughput Screening assay for agonists of the steroid receptor coactivator 2 (SRC-2) recruitment by the peroxisome proliferator-activated receptor gamma (PPARgamma) PubChem Bioassay (2008)[AID] 
Target
Name:
Nuclear receptor coactivator 2
Synonyms:
BHLHE75 NCOA2 protein SRC2 | TIF2
Type:
Enzyme Catalytic Domain
Mol. Mass.:
159156.93
Organism:
Homo sapiens (Human)
Description:
Q15596
Residue:
1464
  
Inhibitor
Name:
BDBM42909
Synonyms:
MLS000039444 N,N-diethyl-2-(1H-imidazo[4,5-b]pyridin-2-ylsulfanyl)ethanamide SMR000036580 | cid_665468
Type:
Small organic molecule
Emp. Form.:
C12H16N4OS
Mol. Mass.:
264.347
SMILES:
CCN(CC)C(=O)CSc1nc2ncccc2[nH]1
: