Target
Nuclear receptor coactivator 2
Ligand
BDBM42910
Substrate
Meas. Tech.
Dose response biochemical High Throughput Screening assay for agonists of the steroid receptor coactivator 2 (SRC-2) recruitment by the peroxisome proliferator-activated receptor gamma (PPARgamma)
EC50
>79370±n/a nM
Citation
 PubChem, PC Dose response biochemical High Throughput Screening assay for agonists of the steroid receptor coactivator 2 (SRC-2) recruitment by the peroxisome proliferator-activated receptor gamma (PPARgamma) PubChem Bioassay (2008)[AID] 
Target
Name:
Nuclear receptor coactivator 2
Synonyms:
BHLHE75 NCOA2 protein SRC2 | TIF2
Type:
Enzyme Catalytic Domain
Mol. Mass.:
159156.93
Organism:
Homo sapiens (Human)
Description:
Q15596
Residue:
1464
  
Inhibitor
Name:
BDBM42910
Synonyms:
2-[[2-(3,5-dimethyl-1-pyrazolyl)-6,6-dimethyl-5,8-dihydropyrano[2,3]thieno[2,4-b]pyrimidin-4-yl]thio]-N-(2-thiazolyl)acetamide 2-[[2-(3,5-dimethylpyrazol-1-yl)-6,6-dimethyl-5,8-dihydropyrano[2,3]thieno[2,4-b]pyrimidin-4-yl]sulfanyl]-N-(1,3-thiazol-2-yl)ethanamide MLS000082959 cid_665681
Type:
Small organic molecule
Emp. Form.:
C21H22N6O2S3
Mol. Mass.:
486.633
SMILES:
Cc1cc(C)n(n1)-c1nc(SCC(=O)Nc2nccs2)c2c3CC(C)(C)OCc3sc2n1
: