Target
Nuclear receptor coactivator 2
Ligand
BDBM42912
Substrate
Meas. Tech.
Dose response biochemical High Throughput Screening assay for agonists of the steroid receptor coactivator 2 (SRC-2) recruitment by the peroxisome proliferator-activated receptor gamma (PPARgamma)
EC50
>79370±n/a nM
Citation
 PubChem, PC Dose response biochemical High Throughput Screening assay for agonists of the steroid receptor coactivator 2 (SRC-2) recruitment by the peroxisome proliferator-activated receptor gamma (PPARgamma) PubChem Bioassay (2008)[AID] 
Target
Name:
Nuclear receptor coactivator 2
Synonyms:
BHLHE75 NCOA2 protein SRC2 | TIF2
Type:
Enzyme Catalytic Domain
Mol. Mass.:
159156.93
Organism:
Homo sapiens (Human)
Description:
Q15596
Residue:
1464
  
Inhibitor
Name:
BDBM42912
Synonyms:
1-(4-fluorophenyl)-2-[[4-prop-2-enyl-5-(thiophen-2-ylmethyl)-1,2,4-triazol-3-yl]sulfanyl]ethanone 2-[[4-allyl-5-(2-thenyl)-1,2,4-triazol-3-yl]thio]-1-(4-fluorophenyl)ethanone SMR000047948 | cid_666732
Type:
Small organic molecule
Emp. Form.:
C18H16FN3OS2
Mol. Mass.:
373.468
SMILES:
Fc1ccc(cc1)C(=O)CSc1nnc(Cc2cccs2)n1CC=C
: