Target
Nuclear receptor coactivator 2
Ligand
BDBM42914
Substrate
Meas. Tech.
Dose response biochemical High Throughput Screening assay for agonists of the steroid receptor coactivator 2 (SRC-2) recruitment by the peroxisome proliferator-activated receptor gamma (PPARgamma)
EC50
50650±n/a nM
Citation
 PubChem, PC Dose response biochemical High Throughput Screening assay for agonists of the steroid receptor coactivator 2 (SRC-2) recruitment by the peroxisome proliferator-activated receptor gamma (PPARgamma) PubChem Bioassay (2008)[AID] 
Target
Name:
Nuclear receptor coactivator 2
Synonyms:
BHLHE75 NCOA2 protein SRC2 | TIF2
Type:
Enzyme Catalytic Domain
Mol. Mass.:
159156.93
Organism:
Homo sapiens (Human)
Description:
Q15596
Residue:
1464
  
Inhibitor
Name:
BDBM42914
Synonyms:
3-(4-ethylphenyl)-6-keto-8-(2-thienyl)-2,4,7,8-tetrahydropyrido[2,1-b][1,3,5]thiadiazine-9-carbonitrile 3-(4-ethylphenyl)-6-oxo-8-thiophen-2-yl-2,4,7,8-tetrahydropyrido[2,1-b][1,3,5]thiadiazine-9-carbonitrile SMR000035440 | cid_666848
Type:
Small organic molecule
Emp. Form.:
C20H19N3OS2
Mol. Mass.:
381.514
SMILES:
CCc1ccc(cc1)N1CSC2=C(C#N)C(CC(=O)N2C1)c1cccs1
: