Target
Nuclear receptor coactivator 2
Ligand
BDBM42919
Substrate
Meas. Tech.
Dose response biochemical High Throughput Screening assay for agonists of the steroid receptor coactivator 2 (SRC-2) recruitment by the peroxisome proliferator-activated receptor gamma (PPARgamma)
EC50
32630±n/a nM
Citation
 PubChem, PC Dose response biochemical High Throughput Screening assay for agonists of the steroid receptor coactivator 2 (SRC-2) recruitment by the peroxisome proliferator-activated receptor gamma (PPARgamma) PubChem Bioassay (2008)[AID] 
Target
Name:
Nuclear receptor coactivator 2
Synonyms:
BHLHE75 NCOA2 protein SRC2 | TIF2
Type:
Enzyme Catalytic Domain
Mol. Mass.:
159156.93
Organism:
Homo sapiens (Human)
Description:
Q15596
Residue:
1464
  
Inhibitor
Name:
BDBM42919
Synonyms:
2-[[5-(2-bromophenyl)-1,3,4-oxadiazol-2-yl]sulfanyl]-1-(2,4,5-trimethylphenyl)ethanone MLS000054918 cid_2113703
Type:
Small organic molecule
Emp. Form.:
C19H17BrN2O2S
Mol. Mass.:
417.319
SMILES:
Cc1cc(C)c(cc1C)C(=O)CSc1nnc(o1)-c1ccccc1Br
: