Target
Nuclear receptor coactivator 2
Ligand
BDBM43106
Substrate
Meas. Tech.
Dose response biochemical High Throughput Screening assay for agonists of the steroid receptor coactivator 2 (SRC-2) recruitment by the peroxisome proliferator-activated receptor gamma (PPARgamma)
EC50
25070±n/a nM
Citation
 PubChem, PC Dose response biochemical High Throughput Screening assay for agonists of the steroid receptor coactivator 2 (SRC-2) recruitment by the peroxisome proliferator-activated receptor gamma (PPARgamma) PubChem Bioassay (2008)[AID] 
Target
Name:
Nuclear receptor coactivator 2
Synonyms:
BHLHE75 NCOA2 protein SRC2 | TIF2
Type:
Enzyme Catalytic Domain
Mol. Mass.:
159156.93
Organism:
Homo sapiens (Human)
Description:
Q15596
Residue:
1464
  
Inhibitor
Name:
BDBM43106
Synonyms:
MLS000393139 cid_4840482
Type:
Small organic molecule
Emp. Form.:
C22H18N2O5S2
Mol. Mass.:
454.519
SMILES:
CC(Sc1cc(cn2c1nc1sc(C)c(C)c1c2=O)C(=O)c1ccccc1O)C(O)=O
: