Target
Nuclear receptor coactivator 3
Ligand
BDBM43032
Substrate
Meas. Tech.
Dose response biochemical High Throughput Screening assay for agonists of the steroid receptor coactivator 3 (SRC-3) recruitment by the peroxisome proliferator-activated receptor gamma (PPARgamma)
EC50
>79370±n/a nM
Citation
 PubChem, PC Dose response biochemical High Throughput Screening assay for agonists of the steroid receptor coactivator 3 (SRC-3) recruitment by the peroxisome proliferator-activated receptor gamma (PPARgamma) PubChem Bioassay (2008)[AID] 
Target
Name:
Nuclear receptor coactivator 3
Synonyms:
AIB1 NCOA3 RAC3 nuclear receptor coactivator 3 isoform a
Type:
Enzyme Catalytic Domain
Mol. Mass.:
155305.29
Organism:
Homo sapiens (Human)
Description:
Q9Y6Q9
Residue:
1424
  
Inhibitor
Name:
BDBM43032
Synonyms:
3-amino-4-(1,3-benzothiazol-2-yl)-N-(3-chloro-2-methyl-phenyl)-5-phenylimino-2H-thiophene-2-carboxamide 3-azanyl-4-(1,3-benzothiazol-2-yl)-N-(3-chloranyl-2-methyl-phenyl)-5-phenylimino-2H-thiophene-2-carboxamide SMR000155505 | cid_3352440
Type:
Small organic molecule
Emp. Form.:
C25H19ClN4OS2
Mol. Mass.:
491.028
SMILES:
Cc1c(Cl)cccc1NC(=O)C1S\C(=N/c2ccccc2)C(=C1N)c1nc2ccccc2s1
: