Target
Eukaryotic translation initiation factor 2-alpha kinase 3
Ligand
BDBM46493
Substrate
Meas. Tech.
Dose response cell-based high-throughput screening assay to measure PERK inhibition
EC50
>55700±n/a nM
Citation
 PubChem, PC Dose response cell-based high-throughput screening assay to measure PERK inhibition PubChem Bioassay (2009)[AID] 
Target
Name:
Eukaryotic translation initiation factor 2-alpha kinase 3
Synonyms:
E2AK3_HUMAN HsPEK PERK Pancreatic endoplasmic reticulum kinase (PERK)
Type:
Enzyme
Mol. Mass.:
125190.66
Organism:
Homo sapiens (Human)
Description:
Q9NZJ5
Residue:
1116
  
Inhibitor
Name:
BDBM46493
Synonyms:
2-(3-chlorophenyl)-1H-pyrrolo[3,4-c]pyridine-1,3(2H)-dione 2-(3-chlorophenyl)pyrrolo[3,4-c]pyridine-1,3-quinone SMR000312288 | cid_1512454
Type:
Small organic molecule
Emp. Form.:
C13H7ClN2O2
Mol. Mass.:
258.66
SMILES:
Clc1cccc(c1)N1C(=O)c2ccncc2C1=O
: