Target
Eukaryotic translation initiation factor 2-alpha kinase 3
Ligand
BDBM46455
Substrate
Meas. Tech.
Counterscreen assay for PERK inhibitors: Dose response cell-based high throughput screening assay to measure inhibition of PERK at 6 hours
EC50
>55700±n/a nM
Citation
 PubChem, PC Counterscreen assay for PERK inhibitors: Dose response cell-based high throughput screening assay to measure inhibition of PERK at 6 hours PubChem Bioassay (2009)[AID] 
Target
Name:
Eukaryotic translation initiation factor 2-alpha kinase 3
Synonyms:
E2AK3_HUMAN HsPEK PERK Pancreatic endoplasmic reticulum kinase (PERK)
Type:
Enzyme
Mol. Mass.:
125190.66
Organism:
Homo sapiens (Human)
Description:
Q9NZJ5
Residue:
1116
  
Inhibitor
Name:
BDBM46455
Synonyms:
3-bromanyl-5-ethoxy-4-methoxy-benzamide 3-bromo-5-ethoxy-4-methoxybenzamide SMR000114541 | cid_900806
Type:
Small organic molecule
Emp. Form.:
C10H12BrNO3
Mol. Mass.:
274.111
SMILES:
CCOc1cc(cc(Br)c1OC)C(N)=O
: