Target
Mannose-6-phosphate isomerase
Ligand
BDBM46640
Substrate
Meas. Tech.
Confirmation of compounds inhibiting phosphomannose isomerase (PMI) via a fluorescence intensity assay.
IC50
>50000±n/a nM
Citation
 PubChem, PC Confirmation of compounds inhibiting phosphomannose isomerase (PMI) via a fluorescence intensity assay. PubChem Bioassay (2010)[AID] 
Target
Name:
Mannose-6-phosphate isomerase
Synonyms:
MPI MPI_HUMAN PMI1
Type:
PROTEIN
Mol. Mass.:
46651.35
Organism:
Homo sapiens (Human)
Description:
ChEMBL_1448919
Residue:
423
  
Inhibitor
Name:
BDBM46640
Synonyms:
2-phenylnaphtho[2,3-g][1,2]benzothiazole-3,6,11-trione cid_4695672
Type:
Small organic molecule
Emp. Form.:
C21H11NO3S
Mol. Mass.:
357.382
SMILES:
O=C1c2ccccc2C(=O)c2c1ccc1c2sn(-c2ccccc2)c1=O
: