Target
Procathepsin L
Ligand
BDBM41285
Substrate
Meas. Tech.
Cathepsin L dose-response testing in the presence of cysteine
IC50
>50000±0 nM
Citation
 PubChem, PC Cathepsin L dose-response testing in the presence of cysteine PubChem Bioassay (2009)[AID] 
Target
Name:
Procathepsin L
Synonyms:
CATL1_HUMAN CTSL CTSL1 Cathepsin L Cathepsin L1 heavy chain MEP cathepsin L preproprotein
Type:
Enzyme
Mol. Mass.:
37557.19
Organism:
Homo sapiens (Human)
Description:
Purchased from Calbiochem (San Diego, CA).
Residue:
333
  
Inhibitor
Name:
BDBM41285
Synonyms:
1-[3-[3-(3-methoxyphenyl)-1,2,4-oxadiazol-5-yl]-1-piperidinyl]-2-phenylethanone 1-[3-[3-(3-methoxyphenyl)-1,2,4-oxadiazol-5-yl]piperidin-1-yl]-2-phenylethanone 1-{3-[3-(3-Methoxy-phenyl)-[1,2,4]oxadiazol-5-yl]-piperidin-1-yl}-2-phenyl-ethanone SMR000007461 | cid_649916
Type:
Small organic molecule
Emp. Form.:
C22H23N3O3
Mol. Mass.:
377.4363
SMILES:
COc1cccc(c1)-c1noc(n1)C1CCCN(C1)C(=O)Cc1ccccc1
: