Target
Protein-tyrosine kinase 2-beta
Ligand
BDBM40551
Substrate
Meas. Tech.
TR-FRET counterscreen for FAK inhibitors: dose-response biochemical high throughput screening assay to identify inhibitors of Proline-rich tyrosine kinase 2 (Pyk2)
IC50
4749±n/a nM
Citation
 PubChem, PC TR-FRET counterscreen for FAK inhibitors: dose-response biochemical high throughput screening assay to identify inhibitors of Proline-rich tyrosine kinase 2 (Pyk2) PubChem Bioassay (2009)[AID] 
Target
Name:
Protein-tyrosine kinase 2-beta
Synonyms:
FAK2 PTK2B PTK2B protein tyrosine kinase 2 beta (PTK2B) Protein tyrosine kinase 2 beta | RAFTK
Type:
Protein
Mol. Mass.:
115868.80
Organism:
Homo sapiens (Human)
Description:
Q14289
Residue:
1009
  
Inhibitor
Name:
BDBM40551
Synonyms:
2-(1H-quinolin-4-ylidene)indane-1,3-quinone 2-(4-quinolyl)indane-1,3-quinone MLS000122777 cid_5765327
Type:
Small organic molecule
Emp. Form.:
C18H11NO2
Mol. Mass.:
273.2854
SMILES:
O=C1C(C(=O)c2ccccc12)c1ccnc2ccccc12
: