Target
Protein-tyrosine kinase 2-beta
Ligand
BDBM41085
Substrate
Meas. Tech.
TR-FRET counterscreen for FAK inhibitors: dose-response biochemical high throughput screening assay to identify inhibitors of Proline-rich tyrosine kinase 2 (Pyk2)
IC50
47700±n/a nM
Citation
 PubChem, PC TR-FRET counterscreen for FAK inhibitors: dose-response biochemical high throughput screening assay to identify inhibitors of Proline-rich tyrosine kinase 2 (Pyk2) PubChem Bioassay (2009)[AID] 
Target
Name:
Protein-tyrosine kinase 2-beta
Synonyms:
FAK2 PTK2B PTK2B protein tyrosine kinase 2 beta (PTK2B) Protein tyrosine kinase 2 beta | RAFTK
Type:
Protein
Mol. Mass.:
115868.80
Organism:
Homo sapiens (Human)
Description:
Q14289
Residue:
1009
  
Inhibitor
Name:
BDBM41085
Synonyms:
6-methyl-4-(4-morpholinoanilino)quinoline-3-carboxylic acid ethyl ester MLS000575705 cid_1190554 ethyl 6-methyl-4-[(4-morpholin-4-ylphenyl)amino]quinoline-3-carboxylate | ethyl 6-methyl-4-{[4-(4-morpholinyl)phenyl]amino}-3-quinolinecarboxylate
Type:
Small organic molecule
Emp. Form.:
C23H25N3O3
Mol. Mass.:
391.4629
SMILES:
CCOC(=O)c1cnc2ccc(C)cc2c1Nc1ccc(cc1)N1CCOCC1
: