Target
Sphingosine 1-phosphate receptor 1
Ligand
BDBM47508
Substrate
Meas. Tech.
Fluorescence-based counterscreen assay for S1P4 agonists: Cell-based dose response high throughput screening assay to identify agonists of the Sphingosine 1-Phosphate Receptor 1 (S1P1)
EC50
93500±n/a nM
Citation
 PubChem, PC Fluorescence-based counterscreen assay for S1P4 agonists: Cell-based dose response high throughput screening assay to identify agonists of the Sphingosine 1-Phosphate Receptor 1 (S1P1) PubChem Bioassay (2010)[AID] 
Target
Name:
Sphingosine 1-phosphate receptor 1
Synonyms:
CHEDG1 Endothelial differentiation G-protein coupled receptor 1 S1P1 S1PR1_HUMAN Sphingosine 1-phosphate receptor Edg-1
Type:
Enzyme
Mol. Mass.:
42836.02
Organism:
Homo sapiens (Human)
Description:
P21453
Residue:
382
  
Inhibitor
Name:
BDBM47508
Synonyms:
1-[[(1E)-1-[2,7-bis(oxidanylidene)chromen-3-ylidene]ethyl]amino]thiourea SMR000413856 [[(1E)-1-(2,7-dioxo-1-benzopyran-3-ylidene)ethyl]amino]thiourea cid_5418014
Type:
Small organic molecule
Emp. Form.:
C12H11N3O3S
Mol. Mass.:
277.299
SMILES:
CC(NNC(N)=S)=c1cc2C=CC(=O)C=c2oc1=O
: