Target
Glutathione S-transferase Mu 1
Ligand
BDBM47570
Substrate
Meas. Tech.
Profiling Assay to determine GST-GSH interactions in multiplex bead-based assays
EC50
1955±n/a nM
Citation
 PubChem, PC Profiling Assay to determine GST-GSH interactions in multiplex bead-based assays PubChem Bioassay (2010)[AID] 
Target
Name:
Glutathione S-transferase Mu 1
Synonyms:
GST class-mu 1 GSTM1 GSTM1_HUMAN GSTM1b-1b Glutathione S-transferase Mu 1 glutathione S-transferase
Type:
PROTEIN
Mol. Mass.:
25712.03
Organism:
Homo sapiens (Human)
Description:
ChEMBL_799596
Residue:
218
  
Inhibitor
Name:
BDBM47570
Synonyms:
(1Z)-1-[[2-[4-(1H-imidazol-2-yl)phthalazin-1-yl]hydrazinyl]methylidene]naphthalen-2-one (1Z)-1-[[[4-(1H-imidazol-2-yl)-1-phthalazinyl]hydrazo]methylidene]-2-naphthalenone SMR000151639 | cid_11948738
Type:
Small organic molecule
Emp. Form.:
C22H16N6O
Mol. Mass.:
380.402
SMILES:
Oc1ccc2ccccc2c1CN=Nc1nnc(-c2ncc[nH]2)c2ccccc12
: