Target
ATP-sensitive inward rectifier potassium channel 1
Ligand
BDBM265503
Substrate
Meas. Tech.
Thallium Flux Assay
IC50
8.40±n/a nM
Citation
 Biswas, DDing, FDong, SGu, XJiang, JPasternak, ASuzuki, TVacca, JXu, S Inhibitors of the renal outer medullary potassium channel US Patent  US9718808 Publication Date 8/1/2017 
Target
Name:
ATP-sensitive inward rectifier potassium channel 1
Synonyms:
ATP-regulated potassium channel ROM-K ATP-sensitive inward rectifier potassium channel 1 KCNJ1 Potassium channel (ATP modulatory) ROMK1 The Renal Outer Medullary Potassium (ROMK)
Type:
Enzyme Catalytic Domain
Mol. Mass.:
44809.08
Organism:
Homo sapiens (Human)
Description:
gi_223460826
Residue:
391
  
Inhibitor
Name:
BDBM265503
Synonyms:
US9718808, 35
Type:
Small organic molecule
Emp. Form.:
C20H24N8O3
Mol. Mass.:
424.4564
SMILES:
C[C@H]1C[C@]2(CC[C@@H](CC2)NCc2ccc(nn2)-n2cnnn2)C(=O)N1C1=CC(=O)OC1
: