Target
Dual specificity protein phosphatase 3
Ligand
BDBM46232
Substrate
Meas. Tech.
SAR VHR1 absorbance Assay for In Vitro dose response studies.
IC50
>100000±n/a nM
Citation
 PubChem, PC SAR VHR1 absorbance Assay for In Vitro dose response studies. PubChem Bioassay (2009)[AID] 
Target
Name:
Dual specificity protein phosphatase 3
Synonyms:
DUS3_HUMAN Dual specificity protein phosphatase (VHR) Dual specificity protein phosphatase VHR Tyrosine-protein phosphatase non-receptor type 1 | VHR
Type:
Hydrolase
Mol. Mass.:
20480.58
Organism:
Homo sapiens (Human)
Description:
Residue:
185
  
Inhibitor
Name:
BDBM46232
Synonyms:
3-(methylsulfamoyl)-N-thiochroman-4-yl-benzamide N-(3,4-dihydro-2H-1-benzothiopyran-4-yl)-3-(methylsulfamoyl)benzamide cid_17407315
Type:
Small organic molecule
Emp. Form.:
C17H18N2O3S2
Mol. Mass.:
362.466
SMILES:
CNS(=O)(=O)c1cccc(c1)C(=O)NC1CCSc2ccccc12
: