Target
Matrix metalloproteinase-14 [1-36]
Ligand
BDBM48145
Substrate
Meas. Tech.
Luminescent HTS for small molecule inhibitors of MT1-MMP transcription
EC50
9290±n/a nM
Citation
 PubChem, PC Luminescent HTS for small molecule inhibitors of MT1-MMP transcription PubChem Bioassay (2008)[AID] 
Target
Name:
Matrix metalloproteinase-14 [1-36]
Synonyms:
MMP14 matrix metalloproteinase 1
Type:
Enzyme Catalytic Domain
Mol. Mass.:
3658.23
Organism:
Homo sapiens (Human)
Description:
gi_6690534
Residue:
36
  
Inhibitor
Name:
BDBM48145
Synonyms:
3-methyl-N-(2-thiazolin-2-yl)coumarilamide N-(4,5-dihydro-1,3-thiazol-2-yl)-3-methyl-1-benzofuran-2-carboxamide SMR000080715 | cid_1247112
Type:
Small organic molecule
Emp. Form.:
C13H12N2O2S
Mol. Mass.:
260.312
SMILES:
Cc1c(oc2ccccc12)C(=O)NC1=NCCS1
: