Target
Matrix metalloproteinase-14 [1-36]
Ligand
BDBM48184
Substrate
Meas. Tech.
Luminescent HTS for small molecule inhibitors of MT1-MMP transcription
EC50
7030±n/a nM
Citation
 PubChem, PC Luminescent HTS for small molecule inhibitors of MT1-MMP transcription PubChem Bioassay (2008)[AID] 
Target
Name:
Matrix metalloproteinase-14 [1-36]
Synonyms:
MMP14 matrix metalloproteinase 1
Type:
Enzyme Catalytic Domain
Mol. Mass.:
3658.23
Organism:
Homo sapiens (Human)
Description:
gi_6690534
Residue:
36
  
Inhibitor
Name:
BDBM48184
Synonyms:
2-(3-chlorophenyl)-5-phenyl-1,3,4-oxadiazole MLS000108072 cid_259755
Type:
Small organic molecule
Emp. Form.:
C14H9ClN2O
Mol. Mass.:
256.687
SMILES:
Clc1cccc(c1)-c1nnc(o1)-c1ccccc1
: