Target
6-phosphofructo-2-kinase/fructose-2,6-bisphosphatase 4
Ligand
BDBM267023
Substrate
Meas. Tech.
PFKFB4 Assay
IC50
4600±n/a nM
Citation
 Martinsson, JFaernegardh, KJoensson, MRingom, R Bisarylsulfonamides useful in the treatment of inflammation and cancer US Patent  US9718809 Publication Date 8/1/2017 
Target
Name:
6-phosphofructo-2-kinase/fructose-2,6-bisphosphatase 4
Synonyms:
6-phosphofructo-2-kinase/fructose-2,6-bisphosphatase 4 (PFKFB4) PFKFB4
Type:
Enzyme
Mol. Mass.:
54039.68
Organism:
Homo sapiens (Human)
Description:
Q16877
Residue:
469
  
Inhibitor
Name:
BDBM267023
Synonyms:
Methyl 2-hydroxy-4-({[4-(trifluoromethyl)phenyl]sulfonyl}amino)benzoate | US9718809, 16
Type:
Small organic molecule
Emp. Form.:
C15H12F3NO5S
Mol. Mass.:
375.32
SMILES:
COC(=O)c1ccc(NS(=O)(=O)c2ccc(cc2)C(F)(F)F)cc1O
: