Target
Transcription factor p65
Ligand
BDBM48145
Substrate
Meas. Tech.
Name: High Throughput Screen to Identify Compounds that increase expression of NF-kB in Human Neuronal Cells - Dose Response
EC50
1031±n/a nM
Citation
 PubChem, PC Name: High Throughput Screen to Identify Compounds that increase expression of NF-kB in Human Neuronal Cells - Dose Response PubChem Bioassay (2008)[AID] 
Target
Name:
Transcription factor p65
Synonyms:
NFKB3 Nuclear factor NF-kappa-B p65 subunit TF65_HUMAN | v-rel reticuloendotheliosis viral oncogene homolog A isoform 1
Type:
Enzyme
Mol. Mass.:
60211.92
Organism:
Homo sapiens (Human)
Description:
Q04206
Residue:
551
  
Inhibitor
Name:
BDBM48145
Synonyms:
3-methyl-N-(2-thiazolin-2-yl)coumarilamide N-(4,5-dihydro-1,3-thiazol-2-yl)-3-methyl-1-benzofuran-2-carboxamide SMR000080715 | cid_1247112
Type:
Small organic molecule
Emp. Form.:
C13H12N2O2S
Mol. Mass.:
260.312
SMILES:
Cc1c(oc2ccccc12)C(=O)NC1=NCCS1
: