Target
Transcription factor p65
Ligand
BDBM37275
Substrate
Meas. Tech.
Name: High Throughput Screen to Identify Compounds that increase expression of NF-kB in Human Neuronal Cells - Dose Response
EC50
6210±n/a nM
Citation
 PubChem, PC Name: High Throughput Screen to Identify Compounds that increase expression of NF-kB in Human Neuronal Cells - Dose Response PubChem Bioassay (2008)[AID] 
Target
Name:
Transcription factor p65
Synonyms:
NFKB3 Nuclear factor NF-kappa-B p65 subunit TF65_HUMAN | v-rel reticuloendotheliosis viral oncogene homolog A isoform 1
Type:
Enzyme
Mol. Mass.:
60211.92
Organism:
Homo sapiens (Human)
Description:
Q04206
Residue:
551
  
Inhibitor
Name:
BDBM37275
Synonyms:
4-[3-(2-methylphenyl)-2H-1,2,4-oxadiazol-5-ylidene]-1-cyclohexa-2,5-dienone 4-[3-(o-tolyl)-2H-1,2,4-oxadiazol-5-ylidene]cyclohexa-2,5-dien-1-one SMR000108415 | cid_5407960
Type:
Small organic molecule
Emp. Form.:
C15H12N2O2
Mol. Mass.:
252.268
SMILES:
Cc1ccccc1-c1noc(n1)-c1ccc(O)cc1
: