Target
Transcription factor p65
Ligand
BDBM49371
Substrate
Meas. Tech.
Name: High Throughput Screen to Identify Compounds that increase expression of NF-kB in Human Neuronal Cells - Dose Response
EC50
659±n/a nM
Citation
 PubChem, PC Name: High Throughput Screen to Identify Compounds that increase expression of NF-kB in Human Neuronal Cells - Dose Response PubChem Bioassay (2008)[AID] 
Target
Name:
Transcription factor p65
Synonyms:
NFKB3 Nuclear factor NF-kappa-B p65 subunit TF65_HUMAN | v-rel reticuloendotheliosis viral oncogene homolog A isoform 1
Type:
Enzyme
Mol. Mass.:
60211.92
Organism:
Homo sapiens (Human)
Description:
Q04206
Residue:
551
  
Inhibitor
Name:
BDBM49371
Synonyms:
1,4,5,6-Tetrahydro-cyclopentapyrazole-3-carboxylic acid (2-bromo-3-phenyl-allylidene)-hydrazide N-[(E)-[(E)-2-bromo-3-phenyl-prop-2-enylidene]amino]-1,4,5,6-tetrahydrocyclopenta[c]pyrazole-3-carboxamide N-[[(Z)-2-bromanyl-3-phenyl-prop-2-enylidene]amino]-1,4,5,6-tetrahydrocyclopenta[c]pyrazole-3-carboxamide N-[[(Z)-2-bromo-3-phenylprop-2-enylidene]amino]-1,4,5,6-tetrahydrocyclopenta[c]pyrazole-3-carboxamide cid_1097667
Type:
Small organic molecule
Emp. Form.:
C16H15BrN4O
Mol. Mass.:
359.22
SMILES:
BrC(C=NNC(=O)c1[nH]nc2CCCc12)=Cc1ccccc1
: