Target
Induced myeloid leukemia cell differentiation protein Mcl-1
Ligand
BDBM50604
Substrate
Meas. Tech.
Dose Response Confirmation for Mcl-1/Noxa Interaction Inhibitors
IC50
23623.07798±n/a nM
Citation
 PubChem, PC Dose Response Confirmation for Mcl-1/Noxa Interaction Inhibitors PubChem Bioassay (2008)[AID] 
Target
Name:
Induced myeloid leukemia cell differentiation protein Mcl-1
Synonyms:
BCL2L3 Bcl-2-like protein 3 (Mcl-1) Bcl2-L-3 MCL1 Mcl-1 Myeloid cell leukemia sequence 1 (BCL2-related) | mcl1/EAT
Type:
Membrane; Single-pass membrane protein
Mol. Mass.:
37332.87
Organism:
Homo sapiens (Human)
Description:
Q07820
Residue:
350
  
Inhibitor
Name:
BDBM50604
Synonyms:
(8S)-3-(3-methacrylamidophenyl)-7-[(E)-2-methylbut-2-enoyl]-1-oxa-2,7-diazaspiro[4.4]non-2-ene-8-carboxamide (8S)-7-[(E)-2-methylbut-2-enoyl]-3-[3-(2-methylprop-2-enoylamino)phenyl]-1-oxa-2,7-diazaspiro[4.4]non-2-ene-8-carboxamide SMR000390645 | cid_16681884
Type:
Small organic molecule
Emp. Form.:
C22H26N4O4
Mol. Mass.:
410.4662
SMILES:
C\C=C(/C)C(=O)N1CC2(C[C@H]1C(N)=O)CC(=NO2)c1cccc(NC(=O)C(C)=C)c1
: