Target
Induced myeloid leukemia cell differentiation protein Mcl-1
Ligand
BDBM50705
Substrate
Meas. Tech.
Dose Response Confirmation for Mcl-1/Noxa Interaction Inhibitors
IC50
2814.592464±n/a nM
Citation
 PubChem, PC Dose Response Confirmation for Mcl-1/Noxa Interaction Inhibitors PubChem Bioassay (2008)[AID] 
Target
Name:
Induced myeloid leukemia cell differentiation protein Mcl-1
Synonyms:
BCL2L3 Bcl-2-like protein 3 (Mcl-1) Bcl2-L-3 MCL1 Mcl-1 Myeloid cell leukemia sequence 1 (BCL2-related) | mcl1/EAT
Type:
Membrane; Single-pass membrane protein
Mol. Mass.:
37332.87
Organism:
Homo sapiens (Human)
Description:
Q07820
Residue:
350
  
Inhibitor
Name:
BDBM50705
Synonyms:
(4E)-4-[[[2-allylimino-4-(2-furyl)-4-thiazolin-3-yl]amino]methylene]-2,3-dihydroxy-cyclohexa-2,5-dien-1-one (4E)-4-[[[4-(furan-2-yl)-2-prop-2-enylimino-1,3-thiazol-3-yl]amino]methylidene]-2,3-bis(oxidanyl)cyclohexa-2,5-dien-1-one MLS001003051 cid_6282071
Type:
Small organic molecule
Emp. Form.:
C17H15N3O4S
Mol. Mass.:
357.384
SMILES:
Oc1ccc(C=Nn2c(csc2=NCC=C)-c2ccco2)c(O)c1O
: