Target
Glycoprotein 42
Ligand
BDBM50785
Substrate
Meas. Tech.
Dose Response Confirmation for Small Molecule Inhibitors of Epstein-Barr Virus
IC50
4630±n/a nM
Citation
 PubChem, PC Dose Response Confirmation for Small Molecule Inhibitors of Epstein-Barr Virus PubChem Bioassay (2008)[AID] 
Target
Name:
Glycoprotein 42
Synonyms:
BZLF2 | GP42_EBVA8
Type:
Enzyme Catalytic Domain
Mol. Mass.:
25424.12
Organism:
Human herpesvirus 4 type 2
Description:
gi_139424501
Residue:
223
  
Inhibitor
Name:
BDBM50785
Synonyms:
1-[3-[1-cyano-2-oxo-2-[(phenylmethyl)amino]ethyl]-2-quinoxalinyl]-3-piperidinecarboxylic acid ethyl ester MLS000079951 cid_660313 ethyl 1-[3-[2-(benzylamino)-1-cyano-2-oxoethyl]quinoxalin-2-yl]piperidine-3-carboxylate
Type:
Small organic molecule
Emp. Form.:
C26H27N5O3
Mol. Mass.:
457.5243
SMILES:
CCOC(=O)C1CCCN(C1)c1nc2ccccc2nc1C(C#N)C(=O)NCc1ccccc1
: