Target
DNA repair protein RAD51 homolog 1
Ligand
BDBM43866
Substrate
Meas. Tech.
Homologous Recombination_Rad51_DNA binding assay
IC50
85000±n/a nM
Citation
 PubChem, PC Homologous Recombination_Rad51_DNA binding assay PubChem Bioassay (2008)[AID] 
Target
Name:
DNA repair protein RAD51 homolog 1
Synonyms:
RAD51 RAD51_HUMAN | RECA
Type:
Enzyme Catalytic Domain
Mol. Mass.:
36960.74
Organism:
Homo sapiens (Human)
Description:
gi_49168602
Residue:
339
  
Inhibitor
Name:
BDBM43866
Synonyms:
2-amino-4,6-dimethyl-3-oxo-1-N,9-N-bis[(3R,6S,7R,10S,16S)-7,11,14-trimethyl-2,5,9,12,15-pentaoxo-3,10-di(propan-2-yl)-8-oxa-1,4,11,14-tetrazabicyclo[14.3.0]nonadecan-6-yl]phenoxazine-1,9-dicarboxamide 2-amino-N,N''''-bis[(3R,6S,7R,10S,16S)-3,10-diisopropyl-2,5,9,12,15-pentaketo-7,11,14-trimethyl-8-oxa-1,4,11,14-tetrazabicyclo[14.3.0]nonadecan-6-yl]-3-keto-4,6-dimethyl-phenoxazine-1,9-dicarboxamide 2-amino-N,N'-bis[(3R,6S,7R,10S,16S)-3,10-diisopropyl-2,5,9,12,15-pentaketo-7,11,14-trimethyl-8-oxa-1,4,11,14-tetrazabicyclo[14.3.0]nonadecan-6-yl]-3-keto-4,6-dimethyl-phenoxazine-1,9-dicarboxamide DACTINOMYCIN MLS001424196 cid_457193
Type:
Peptide
Emp. Form.:
C62H86N12O16
Mol. Mass.:
1255.417
SMILES:
CC(C)[C@H]1NC(=O)[C@@H](NC(=O)c2ccc(C)c3oc4c(C)c(=O)c(N)c(C(=O)N[C@H]5[C@@H](C)OC(=O)[C@H](C(C)C)N(C)C(=O)CN(C)C(=O)[C@@H]6CCCN6C(=O)[C@H](NC5=O)C(C)C)c4nc23)[C@@H](C)OC(=O)[C@H](C(C)C)N(C)C(=O)CN(C)C(=O)[C@@H]2CCCN2C1=O
: