Target
DNA repair protein RAD51 homolog 1
Ligand
BDBM38621
Substrate
Meas. Tech.
Homologous recombination_Rad 51_dose response_2
IC50
53000±n/a nM
Citation
 PubChem, PC Homologous recombination_Rad 51_dose response_2 PubChem Bioassay (2008)[AID] 
Target
Name:
DNA repair protein RAD51 homolog 1
Synonyms:
RAD51 RAD51_HUMAN | RECA
Type:
Enzyme Catalytic Domain
Mol. Mass.:
36960.74
Organism:
Homo sapiens (Human)
Description:
gi_49168602
Residue:
339
  
Inhibitor
Name:
BDBM38621
Synonyms:
MLS000050598 N-(2-ethyl-2H-tetrazol-5-yl)-3-(2-oxo-2H-chromen-3-yl)benzamide N-(2-ethyltetrazol-5-yl)-3-(2-ketochromen-3-yl)benzamide SMR000077721 | cid_1091686
Type:
Small organic molecule
Emp. Form.:
C19H15N5O3
Mol. Mass.:
361.3541
SMILES:
CCn1nnc(NC(=O)c2cccc(c2)-c2cc3ccccc3oc2=O)n1
: