Target
DNA repair protein RAD51 homolog 1
Ligand
BDBM51324
Substrate
Meas. Tech.
Homologous recombination_Rad 51_dose response_2
IC50
53000±n/a nM
Citation
 PubChem, PC Homologous recombination_Rad 51_dose response_2 PubChem Bioassay (2008)[AID] 
Target
Name:
DNA repair protein RAD51 homolog 1
Synonyms:
RAD51 RAD51_HUMAN | RECA
Type:
Enzyme Catalytic Domain
Mol. Mass.:
36960.74
Organism:
Homo sapiens (Human)
Description:
gi_49168602
Residue:
339
  
Inhibitor
Name:
BDBM51324
Synonyms:
1-bromanylnaphthalen-2-ol 1-bromo-2-naphthol MLS000069595 cid_11316
Type:
Small organic molecule
Emp. Form.:
C10H7BrO
Mol. Mass.:
223.066
SMILES:
Oc1ccc2ccccc2c1Br
: