Target
DNA repair protein RAD51 homolog 1
Ligand
BDBM50230
Substrate
Meas. Tech.
Homologous recombination_Rad 51_dose response_2
IC50
53000±n/a nM
Citation
 PubChem, PC Homologous recombination_Rad 51_dose response_2 PubChem Bioassay (2008)[AID] 
Target
Name:
DNA repair protein RAD51 homolog 1
Synonyms:
RAD51 RAD51_HUMAN | RECA
Type:
Enzyme Catalytic Domain
Mol. Mass.:
36960.74
Organism:
Homo sapiens (Human)
Description:
gi_49168602
Residue:
339
  
Inhibitor
Name:
BDBM50230
Synonyms:
(E)-3-(4-chloranyl-3-nitro-phenyl)-N-(4-pyrrolidin-1-ylphenyl)prop-2-enamide (E)-3-(4-chloro-3-nitrophenyl)-N-(4-pyrrolidin-1-ylphenyl)prop-2-enamide 3-(4-chloro-3-nitrophenyl)-N-[4-(1-pyrrolidinyl)phenyl]acrylamide SMR000196170 | cid_1332381
Type:
Small organic molecule
Emp. Form.:
C19H18ClN3O3
Mol. Mass.:
371.818
SMILES:
[O-][N+](=O)c1cc(\C=C\C(=O)Nc2ccc(cc2)N2CCCC2)ccc1Cl
: