Target
Amine oxidase [flavin-containing] B
Ligand
BDBM256646
Substrate
Meas. Tech.
MAO-B Inhibitory Assay
pH
7.5±n/a
Temperature
298.15±n/a K
IC50
>100000±n/a nM
Comments
extracted
Citation
 Matsumoto, SHattori, YToyofuku, MMorimoto, SKojima, TKaku, TIto, M Cyclopropanamine compound and use thereof US Patent  US9718814 Publication Date 8/1/2017 
Target
Name:
Amine oxidase [flavin-containing] B
Synonyms:
AOFB_HUMAN MAOB Monoamine oxidase type B (MAO B) Monoamine oxidase type B (MAOB)
Type:
Protein
Mol. Mass.:
58768.76
Organism:
Homo sapiens (Human)
Description:
P27338
Residue:
520
  
Inhibitor
Name:
BDBM256646
Synonyms:
US10053456, 25 US10968213, Example 25 US9718814, 25 | US9920047, 25
Type:
Small organic molecule
Emp. Form.:
C13H16N4OS
Mol. Mass.:
276.357
SMILES:
Cc1sc(cc1C1CC1N)C(=O)Nc1cnn(C)c1
: