Target
Beta-lactamase
Ligand
BDBM51978
Substrate
Meas. Tech.
FRET-based counterscreen for selective VIM-2 inhibitors: dose response biochemical high throughput screening assay to identify inhibitors of IMP-1 metallo-beta-lactamase.
IC50
59640±n/a nM
Citation
 PubChem, PC FRET-based counterscreen for selective VIM-2 inhibitors: dose response biochemical high throughput screening assay to identify inhibitors of IMP-1 metallo-beta-lactamase. PubChem Bioassay (2009)[AID] 
Target
Name:
Beta-lactamase
Synonyms:
Beta-lactamase | metallo-beta-lactamase IMP-1
Type:
Enzyme Catalytic Domain
Mol. Mass.:
27125.88
Organism:
Pseudomonas aeruginosa
Description:
gi_27368096
Residue:
246
  
Inhibitor
Name:
BDBM51978
Synonyms:
MLS000680027 cid_4870494
Type:
Small organic molecule
Emp. Form.:
C16H16N2OS2
Mol. Mass.:
316.441
SMILES:
[H]C12CCC([H])(C1)C1C2Sc2[nH]c(=O)sc2C1c1cccnc1
: