Target
Zinc finger protein mex-5
Ligand
BDBM52414
Substrate
Meas. Tech.
Fluorescent Polarization Homogeneous Dose Response HTS to Indentify Inhibitors of Mex-5 Binding to TCR-2
EC50
300000±n/a nM
Citation
 PubChem, PC Fluorescent Polarization Homogeneous Dose Response HTS to Indentify Inhibitors of Mex-5 Binding to TCR-2 PubChem Bioassay (2009)[AID] 
Target
Name:
Zinc finger protein mex-5
Synonyms:
MEX5_CAEEL mex-5
Type:
Enzyme Catalytic Domain
Mol. Mass.:
52832.78
Organism:
Caenorhabditis elegans
Description:
gi_55976631
Residue:
468
  
Inhibitor
Name:
BDBM52414
Synonyms:
1-tert-butyl-3-(2-phenylethyl)thiourea MLS000581512 SMR000200139 | cid_972345
Type:
Small organic molecule
Emp. Form.:
C13H20N2S
Mol. Mass.:
236.376
SMILES:
CC(C)(C)NC(=S)NCCc1ccccc1
: