Target
Zinc finger protein mex-5
Ligand
BDBM50572
Substrate
Meas. Tech.
Fluorescent Polarization Homogeneous Dose Response HTS to Indentify Inhibitors of Mex-5 Binding to TCR-2
EC50
300000±n/a nM
Citation
 PubChem, PC Fluorescent Polarization Homogeneous Dose Response HTS to Indentify Inhibitors of Mex-5 Binding to TCR-2 PubChem Bioassay (2009)[AID] 
Target
Name:
Zinc finger protein mex-5
Synonyms:
MEX5_CAEEL mex-5
Type:
Enzyme Catalytic Domain
Mol. Mass.:
52832.78
Organism:
Caenorhabditis elegans
Description:
gi_55976631
Residue:
468
  
Inhibitor
Name:
BDBM50572
Synonyms:
(3S,4S)-5-[(3S,4S)-4,10-dihydroxy-7,9-dimethoxy-3-methyl-3,4-dihydro-1H-benz[g]isochromen-5-yl]-7,9-dimethoxy-3-methyl-3,4-dihydro-1H-benz[g]isochromene-4,10-diol (3S,4S)-5-[(3S,4S)-4,10-dihydroxy-7,9-dimethoxy-3-methyl-3,4-dihydro-1H-benzo[g]isochromen-5-yl]-7,9-dimethoxy-3-methyl-3,4-dihydro-1H-benzo[g]isochromene-4,10-diol MLS000876833 cid_10257591
Type:
Small organic molecule
Emp. Form.:
C32H34O10
Mol. Mass.:
578.6064
SMILES:
COc1cc(OC)c2c(O)c3CO[C@@H](C)[C@@H](O)c3c(-c3c4[C@H](O)[C@H](C)OCc4c(O)c4c(OC)cc(OC)cc34)c2c1
: