Target
Dual specificity protein phosphatase 6
Ligand
BDBM46207
Substrate
Meas. Tech.
MKP-3 in vitro HTS assay
IC50
76700±n/a nM
Citation
 PubChem, PC MKP-3 in vitro HTS assay PubChem Bioassay (2009)[AID] 
Target
Name:
Dual specificity protein phosphatase 6
Synonyms:
DUS6_RAT MAP kinase phosphatase 3 Mitogen-activated protein kinase phosphatase 3 | Mkp3
Type:
Enzyme
Mol. Mass.:
42303.19
Organism:
Rattus norvegicus
Description:
gi_16758752
Residue:
381
  
Inhibitor
Name:
BDBM46207
Synonyms:
4-[[5-(4-bromophenyl)-2-furoyl]thiocarbamoylamino]benzoic acid 4-[[5-(4-bromophenyl)furan-2-yl]carbonylcarbamothioylamino]benzoic acid MLS-0383777.0001 | cid_1328767
Type:
Small organic molecule
Emp. Form.:
C19H13BrN2O4S
Mol. Mass.:
445.287
SMILES:
OC(=O)c1ccc(NC(=S)NC(=O)c2ccc(o2)-c2ccc(Br)cc2)cc1
: