Target
Gag-Pol polyprotein
Ligand
BDBM267354
Substrate
Meas. Tech.
HIV-1 Reverse Transcriptase Inhibitory Assay
pH
7.8±n/a
Temperature
298.15±n/a K
IC50
12.0±n/a nM
Comments
extracted
Citation
 Arrington, KLBurgey, CGilfillan, RHan, YPatel, MLi, CSLuo, YLei, Z Non-nucleoside reverse transcriptase inhibitors US Patent  US9718819 Publication Date 8/1/2017 
Target
Name:
Gag-Pol polyprotein
Synonyms:
HIV-1 reverse transcriptase (HIV-1 RT) POL_HV1H2 Protease Reverse transcriptase (RT) gag-pol p66 RT
Type:
Protein
Mol. Mass.:
162074.74
Organism:
Human immunodeficiency virus type 1 group M subtype B (isolate HXB2)
Description:
P04585
Residue:
1435
  
Inhibitor
Name:
BDBM267354
Synonyms:
3-((1-((2-(tert-butyl)-6-oxo-1,6-dihydropyrimidin-5-yl)methyl)-6-oxo-4-(trifluoromethyl)-1,6-dihydropyrimidin-5-yl)oxy)-5-chlorobenzonitrile US9718819, 130
Type:
Small organic molecule
Emp. Form.:
C21H17ClF3N5O3
Mol. Mass.:
479.84
SMILES:
CC(C)(C)c1ncc(Cn2cnc(c(Oc3cc(Cl)cc(c3)C#N)c2=O)C(F)(F)F)c(=O)[nH]1
: