Target
Nucleotide-binding oligomerization domain-containing protein 2
Ligand
BDBM36852
Substrate
Meas. Tech.
uHTS luminescence assay for the identification of compounds that inhibit NOD2 in MDP treated cells
IC50
4786±n/a nM
Citation
 PubChem, PC uHTS luminescence assay for the identification of compounds that inhibit NOD2 in MDP treated cells PubChem Bioassay (2010)[AID] 
Target
Name:
Nucleotide-binding oligomerization domain-containing protein 2
Synonyms:
CARD15 IBD1 NOD2 Nucleotide-binding oligomerization domain-containing protein 2 | nucleotide-binding oligomerization domain containing 2
Type:
PROTEIN
Mol. Mass.:
115287.18
Organism:
Homo sapiens (Human)
Description:
ChEMBL_1454053
Residue:
1040
  
Inhibitor
Name:
BDBM36852
Synonyms:
MLS000073104 N-[4-(1,3-benzodioxol-5-yl)-1,3-thiazol-2-yl]pyridine-4-carboxamide N-[4-(1,3-benzodioxol-5-yl)thiazol-2-yl]isonicotinamide cid_650651
Type:
Small organic molecule
Emp. Form.:
C16H11N3O3S
Mol. Mass.:
325.342
SMILES:
O=C(Nc1nc(cs1)-c1ccc2OCOc2c1)c1ccncc1
: