Target
Isoform Bcl-X(L) of Bcl-2-like protein 1 (Bcl-xL)
Ligand
BDBM33199
Substrate
Meas. Tech.
Confirmation dose response of hits from multiplexed high-throughput screen for small molecule regulators of Bcl-2 family protein interactions, specifically Bim-Bcl-XL
EC50
43550±n/a nM
Citation
 PubChem, PC Confirmation dose response of hits from multiplexed high-throughput screen for small molecule regulators of Bcl-2 family protein interactions, specifically Bim-Bcl-XL PubChem Bioassay (2009)[AID] 
Target
Name:
Isoform Bcl-X(L) of Bcl-2-like protein 1 (Bcl-xL)
Synonyms:
B-cell lymphoma-extra large protein (Bcl-xL) BCL-xL BCL2L1 Bcl-2-like protein 1 (Bcl-xL) | Isoform Bcl-X(L)
Type:
Homodimers/heterodimers with BAX, BAK and BCL2
Mol. Mass.:
26053.63
Organism:
Homo sapiens (Human)
Description:
gi_510901
Residue:
233
  
Inhibitor
Name:
BDBM33199
Synonyms:
3-benzyl-7-methyl-8-(5-methyl-2-furyl)xanthine 7-methyl-8-(5-methyl-2-furanyl)-3-(phenylmethyl)purine-2,6-dione MLS001007637 cid_4878679
Type:
Small organic molecule
Emp. Form.:
C18H16N4O3
Mol. Mass.:
336.3446
SMILES:
Cc1ccc(o1)-c1nc2n(Cc3ccccc3)c(=O)[nH]c(=O)c2n1C
: