Target
Kappa-type opioid receptor
Ligand
BDBM54807
Substrate
Meas. Tech.
HTS Image-Based Screen for Selective Antagonists of the KOR Receptor
IC50
3856±393 nM
Citation
 PubChem, PC HTS Image-Based Screen for Selective Antagonists of the KOR Receptor PubChem Bioassay (2009)[AID] 
Target
Name:
Kappa-type opioid receptor
Synonyms:
K-OR-1 Kappa-opioid receptor (KOR) Kappa-type opioid receptor (KOR) OPIATE Kappa OPRK1 kappa opioid receptor (KOR)
Type:
G Protein-Coupled Receptor (GPCR)
Mol. Mass.:
42648.76
Organism:
Homo sapiens (Human)
Description:
P41145
Residue:
380
  
Inhibitor
Name:
BDBM54807
Synonyms:
4-(2,5-dimethoxyphenyl)-N-[(Z)-3-indolylidenemethyl]-2-(2-methoxyethylimino)-3-thiazolamine MLS000375345 [4-(2,5-dimethoxyphenyl)-2-(2-methoxyethylimino)-4-thiazolin-3-yl]-[(Z)-indol-3-ylidenemethyl]amine | cid_6508436
Type:
Small organic molecule
Emp. Form.:
C23H24N4O3S
Mol. Mass.:
436.527
SMILES:
COCCN=c1scc(-c2cc(OC)ccc2OC)n1N=Cc1c[nH]c2ccccc12
: