Target
Plectin
Ligand
BDBM54947
Substrate
Meas. Tech.
HTS TR-FRET-based dose response confirmatory assay for Siah-1
IC50
4382.147±2030 nM
Citation
 PubChem, PC HTS TR-FRET-based dose response confirmatory assay for Siah-1 PubChem Bioassay (2009)[AID] 
Target
Name:
Plectin
Synonyms:
PLEC PLEC_HUMAN | plectin 1
Type:
Enzyme Catalytic Domain
Mol. Mass.:
531740.96
Organism:
Homo sapiens (Human)
Description:
Q15149
Residue:
4684
  
Inhibitor
Name:
BDBM54947
Synonyms:
(2S)-2-[2-[4,8-dimethyl-2-oxidanylidene-3-(phenylmethyl)chromen-7-yl]oxyethanoylamino]-3-phenyl-propanoic acid (2S)-2-[[2-(3-benzyl-4,8-dimethyl-2-oxochromen-7-yl)oxyacetyl]amino]-3-phenylpropanoic acid MLS001141331 cid_1753226
Type:
Small organic molecule
Emp. Form.:
C29H27NO6
Mol. Mass.:
485.5278
SMILES:
Cc1c(OCC(=O)N[C@@H](Cc2ccccc2)C(O)=O)ccc2c(C)c(Cc3ccccc3)c(=O)oc12
: