Target
Mitogen-activated protein kinase kinase kinase 3
Ligand
BDBM54951
Substrate
Meas. Tech.
SAR Compounds tested by Dose Response Screen via Multiplex HTS Assay for Inhibitors of MEK Kinase PB1 Domains, specifically MEK5 binding to MEK Kinase 3 Wildtype.
EC50
>30000±n/a nM
Citation
 PubChem, PC SAR Compounds tested by Dose Response Screen via Multiplex HTS Assay for Inhibitors of MEK Kinase PB1 Domains, specifically MEK5 binding to MEK Kinase 3 Wildtype. PubChem Bioassay (2009)[AID] 
Target
Name:
Mitogen-activated protein kinase kinase kinase 3
Synonyms:
M3K3_HUMAN MAPKKK3 Mitogen-activated protein kinase kinase kinase 3 | mitogen-activated protein kinase kinase kinase 3 isoform 1
Type:
PROTEIN
Mol. Mass.:
70916.05
Organism:
Homo sapiens (Human)
Description:
ChEMBL_774345
Residue:
626
  
Inhibitor
Name:
BDBM54951
Synonyms:
(6Z)-3-(2-furanyl)-6-(2-pyrrolylidene)-5H-[1,2,4]triazolo[3,4-b][1,3,4]thiadiazole (6Z)-3-(furan-2-yl)-6-pyrrol-2-ylidene-5H-[1,2,4]triazolo[3,4-b][1,3,4]thiadiazole cid_44236874
Type:
Small organic molecule
Emp. Form.:
C11H7N5OS
Mol. Mass.:
257.271
SMILES:
c1c[nH]c(c1)-c1nn2c(nnc2s1)-c1ccco1
: