Target
Genome polyprotein
Ligand
BDBM54721
Substrate
Meas. Tech.
Fluorescence-based biochemical high throughput dose response assay for inhibitors of the Hepatitis C Virus non-structural protein 3 helicase (NS3).
IC50
7092±n/a nM
Citation
 PubChem, PC Fluorescence-based biochemical high throughput dose response assay for inhibitors of the Hepatitis C Virus non-structural protein 3 helicase (NS3). PubChem Bioassay (2009)[AID] 
Target
Name:
Genome polyprotein
Synonyms:
NS3
Type:
Enzyme Catalytic Domain
Mol. Mass.:
67067.41
Organism:
Hepatitis C virus
Description:
gi_125541954
Residue:
631
  
Inhibitor
Name:
BDBM54721
Synonyms:
3-(4-bromophenyl)-6-keto-8-(5-methyl-2-furyl)-2,4,7,8-tetrahydropyrido[2,1-b][1,3,5]thiadiazine-9-carbonitrile 3-(4-bromophenyl)-8-(5-methylfuran-2-yl)-6-oxidanylidene-2,4,7,8-tetrahydropyrido[2,1-b][1,3,5]thiadiazine-9-carbonitrile MLS000080647 cid_666034
Type:
Small organic molecule
Emp. Form.:
C19H16BrN3O2S
Mol. Mass.:
430.318
SMILES:
Cc1ccc(o1)C1CC(=O)N2CN(CSC2=C1C#N)c1ccc(Br)cc1
: