Target
Kallikrein-5
Ligand
BDBM38392
Substrate
Meas. Tech.
Kallikrein 5 1536 HTS Dose Response Confirmation
IC50
50000±n/a nM
Citation
 PubChem, PC Kallikrein 5 1536 HTS Dose Response Confirmation PubChem Bioassay (2008)[AID] 
Target
Name:
Kallikrein-5
Synonyms:
KLK5 Kallikrein 5 kallikrein-related peptidase 5 preproprotein
Type:
PROTEIN
Mol. Mass.:
32031.72
Organism:
Homo sapiens (Human)
Description:
EBI_12584
Residue:
293
  
Inhibitor
Name:
BDBM38392
Synonyms:
3-(3,4-dimethoxyphenyl)-7-hydroxy-1-benzopyran-4-one 3-(3,4-dimethoxyphenyl)-7-hydroxy-chromone 3-(3,4-dimethoxyphenyl)-7-oxidanyl-chromen-4-one SMR000020618 | cid_5748605
Type:
Small organic molecule
Emp. Form.:
C17H14O5
Mol. Mass.:
298.2901
SMILES:
COc1ccc(cc1OC)-c1coc2cc(O)ccc2c1=O
: